Target
Tyrosine-protein phosphatase non-receptor type 1
Ligand
BDBM50341989
Substrate
Meas. Tech.
ChEMBL_743505 (CHEMBL1767946)
IC50
8000±n/a nM
Citation
 Vintonyak, VVWaldmann, HRauh, D Using small molecules to target protein phosphatases. Bioorg Med Chem 19:2145-55 (2011)  
Target
Name:
Tyrosine-protein phosphatase non-receptor type 1
Synonyms:
PTN1_HUMAN PTPN1 Protein tyrosine phosphatase-1B (PTP1B) Protein-tyrosine phosphatase 1B (PTP1B) Tyrosine-protein phosphatase non-receptor type 1 (PTP1B)
Type:
Protein phosphatase
Mol. Mass.:
49963.76
Organism:
Homo sapiens (Human)
Description:
Human recombinant GST-fusion PTP1B (1-435).
Residue:
435
  
Inhibitor
Name:
BDBM50341989
Synonyms:
3-(3,5-DIBROMO-4-HYDROXY-BENZOYL)-2-ETHYL-BENZOFURAN-6-SULFONIC ACID [4-(THIAZOL-2-YLSULFAMOYL)-PHENYL]-AMIDE CHEMBL1232829
Type:
Small organic molecule
Emp. Form.:
C26H19Br2N3O7S3
Mol. Mass.:
741.448
SMILES:
CCc1oc2cc(ccc2c1C(=O)c1cc(Br)c(O)c(Br)c1)S(=O)(=O)Nc1ccc(cc1)S(=O)(=O)Nc1nccs1
: