Target
Metabotropic glutamate receptor 5
Ligand
BDBM50342477
Substrate
Meas. Tech.
ChEMBL_744540 (CHEMBL1772561)
IC50
>10000±n/a nM
Citation
 Lamb, JPEngers, DWNiswender, CMRodriguez, ALVenable, DFConn, JPLindsley, CW Discovery of molecular switches within the ADX-47273 mGlu5 PAM scaffold that modulate modes of pharmacology to afford potent mGlu5 NAMs, PAMs and partial antagonists. Bioorg Med Chem Lett 21:2711-4 (2011)  
Target
Name:
Metabotropic glutamate receptor 5
Synonyms:
GPRC1E GRM5_HUMAN metabotropic glutamate 5 | metabotropic glutamate 5a
Type:
Enzyme
Mol. Mass.:
132484.72
Organism:
Homo sapiens (Human)
Description:
Residue:
1212
  
Inhibitor
Name:
BDBM50342477
Synonyms:
(R)-cyclobutyl(3-(3-(3-methoxyphenyl)-1,2,4-oxadiazol-5-yl)piperidin-1-yl)methanone | CHEMBL1771624
Type:
Small organic molecule
Emp. Form.:
C19H23N3O3
Mol. Mass.:
341.4042
SMILES:
COc1cccc(c1)-c1noc(n1)[C@@H]1CCCN(C1)C(=O)C1CCC1
: