Target
Acid-sensing ion channel 3
Ligand
BDBM50342640
Substrate
Meas. Tech.
ChEMBL_745055 (CHEMBL1772131)
IC50
10900±n/a nM
Citation
 Wolkenberg, SEZhao, ZMulhearn, JJHarrison, STSanders, JMCato, MJJovanovska, APanigel, JCook, SPHenze, DAKane, SAHartman, GDBarrow, JC High concentration electrophysiology-based fragment screen: discovery of novel acid-sensing ion channel 3 (ASIC3) inhibitors. Bioorg Med Chem Lett 21:2646-9 (2011)  
Target
Name:
Acid-sensing ion channel 3
Synonyms:
ACCN3 ASIC3_HUMAN SLNAC1 | TNAC1
Type:
PROTEIN
Mol. Mass.:
58910.26
Organism:
Homo sapiens (Human)
Description:
ChEMBL_757561
Residue:
531
  
Inhibitor
Name:
BDBM50342640
Synonyms:
6-bromo-2-((5-methoxy-1H-indol-3-yl)methyl)-1,2,3,4-tetrahydroisoquinoline | CHEMBL1770743
Type:
Small organic molecule
Emp. Form.:
C19H19BrN2O
Mol. Mass.:
371.271
SMILES:
COc1ccc2[nH]cc(CN3CCc4cc(Br)ccc4C3)c2c1
: