Target
Acid-sensing ion channel 3
Ligand
BDBM50342663
Substrate
Meas. Tech.
ChEMBL_745055 (CHEMBL1772131)
IC50
27600±n/a nM
Citation
 Wolkenberg, SEZhao, ZMulhearn, JJHarrison, STSanders, JMCato, MJJovanovska, APanigel, JCook, SPHenze, DAKane, SAHartman, GDBarrow, JC High concentration electrophysiology-based fragment screen: discovery of novel acid-sensing ion channel 3 (ASIC3) inhibitors. Bioorg Med Chem Lett 21:2646-9 (2011)  
Target
Name:
Acid-sensing ion channel 3
Synonyms:
ACCN3 ASIC3_HUMAN SLNAC1 | TNAC1
Type:
PROTEIN
Mol. Mass.:
58910.26
Organism:
Homo sapiens (Human)
Description:
ChEMBL_757561
Residue:
531
  
Inhibitor
Name:
BDBM50342663
Synonyms:
4-(6-bromo-3,4-dihydroisoquinolin-2(1H)-yl)-2-methylquinoline | CHEMBL1770742
Type:
Small organic molecule
Emp. Form.:
C19H17BrN2
Mol. Mass.:
353.256
SMILES:
Cc1cc(N2CCc3cc(Br)ccc3C2)c2ccccc2n1
: