Target
Dual specificity protein kinase CLK1
Ligand
BDBM50342926
Substrate
Meas. Tech.
ChEMBL_744227 (CHEMBL1772034)
IC50
11±n/a nM
Citation
 Rosenthal, ASTanega, CShen, MMott, BTBougie, JMNguyen, DTMisteli, TAuld, DSMaloney, DJThomas, CJ Potent and selective small molecule inhibitors of specific isoforms of Cdc2-like kinases (Clk) and dual specificity tyrosine-phosphorylation-regulated kinases (Dyrk). Bioorg Med Chem Lett 21:3152-8 (2011)  
Target
Name:
Dual specificity protein kinase CLK1
Synonyms:
CDC-like kinase 1 CDC2-like kinase 1 (CLK1) CLK1 Dual specificity protein kinase CLK1 Dual specificty protein kinase CLK1
Type:
Protein
Mol. Mass.:
57322.21
Organism:
Homo sapiens (Human)
Description:
P49759
Residue:
484
  
Inhibitor
Name:
BDBM50342926
Synonyms:
6-(benzo[d][1,3]dioxol-5-yl)-N-methyl-N-(thiophen-2-ylmethyl)quinazolin-4-amine | CHEMBL1591577
Type:
Small organic molecule
Emp. Form.:
C21H17N3O2S
Mol. Mass.:
375.444
SMILES:
CN(Cc1cccs1)c1ncnc2ccc(cc12)-c1ccc2OCOc2c1
: