Target
Dual specificity tyrosine-phosphorylation-regulated kinase 1B
Ligand
BDBM50342916
Substrate
Meas. Tech.
ChEMBL_744230 (CHEMBL1772037)
IC50
25±n/a nM
Citation
 Rosenthal, ASTanega, CShen, MMott, BTBougie, JMNguyen, DTMisteli, TAuld, DSMaloney, DJThomas, CJ Potent and selective small molecule inhibitors of specific isoforms of Cdc2-like kinases (Clk) and dual specificity tyrosine-phosphorylation-regulated kinases (Dyrk). Bioorg Med Chem Lett 21:3152-8 (2011)  
Target
Name:
Dual specificity tyrosine-phosphorylation-regulated kinase 1B
Synonyms:
DYR1B_HUMAN Dual specificity tyrosine-phosphorylation-regulated kinase 1B MIRK
Type:
Enzyme
Mol. Mass.:
69222.24
Organism:
Homo sapiens (Human)
Description:
Q9Y463
Residue:
629
  
Inhibitor
Name:
BDBM50342916
Synonyms:
6-(benzo[d][1,3]dioxol-5-yl)-N-methyl-N-((2-methylthiazol-4-yl)methyl)quinazolin-4-amine | CHEMBL1474834
Type:
Small organic molecule
Emp. Form.:
C21H18N4O2S
Mol. Mass.:
390.458
SMILES:
CN(Cc1csc(C)n1)c1ncnc2ccc(cc12)-c1ccc2OCOc2c1
: