Target
Dual specificity protein kinase CLK4
Ligand
BDBM50342910
Substrate
Meas. Tech.
ChEMBL_744201 (CHEMBL1771958)
IC50
40±n/a nM
Citation
 Rosenthal, ASTanega, CShen, MMott, BTBougie, JMNguyen, DTMisteli, TAuld, DSMaloney, DJThomas, CJ Potent and selective small molecule inhibitors of specific isoforms of Cdc2-like kinases (Clk) and dual specificity tyrosine-phosphorylation-regulated kinases (Dyrk). Bioorg Med Chem Lett 21:3152-8 (2011)  
Target
Name:
Dual specificity protein kinase CLK4
Synonyms:
CDC-like kinase 4 CLK4_HUMAN | Dual specificity protein kinase CLK1/CLK4
Type:
Serine/threonine-protein kinase
Mol. Mass.:
57522.53
Organism:
Homo sapiens (Human)
Description:
gi_10190706
Residue:
481
  
Inhibitor
Name:
BDBM50342910
Synonyms:
6-(benzo[d][1,3]dioxol-5-yl)-N-((2-methylthiazol-4-yl)methyl)quinazolin-4-amine | CHEMBL1435542
Type:
Small organic molecule
Emp. Form.:
C20H16N4O2S
Mol. Mass.:
376.432
SMILES:
Cc1nc(CNc2ncnc3ccc(cc23)-c2ccc3OCOc3c2)cs1
: