Target
Histamine H4 receptor
Ligand
BDBM50342982
Substrate
Meas. Tech.
ChEMBL_744294 (CHEMBL1772151)
Ki
6±n/a nM
Citation
 Meduna, SPSavall, BMCai, HEdwards, JPThurmond, RLMcGovern, PM Triamino pyrimidines and pyridines as histamine H(4) receptor modulators. Bioorg Med Chem Lett 21:3113-6 (2011)  
Target
Name:
Histamine H4 receptor
Synonyms:
AXOR35 GPCR105 HH4R HRH4 Histamine H4 receptor Histamine receptor (H3 and H4) SP9144
Type:
G Protein-Coupled Receptor (GPCR)
Mol. Mass.:
44517.02
Organism:
Homo sapiens (Human)
Description:
Binding assays were using CHO cells stably expressing hH4R receptors.
Residue:
390
  
Inhibitor
Name:
BDBM50342982
Synonyms:
4-(4-Methylpiperazin-1-yl)-6-pyrrolidin-1-ylpyrimidin-2-ylamine CHEMBL505061
Type:
Small organic molecule
Emp. Form.:
C13H22N6
Mol. Mass.:
262.354
SMILES:
CN1CCN(CC1)c1cc(nc(N)n1)N1CCCC1
: