Target
Histamine H4 receptor
Ligand
BDBM50343001
Substrate
Meas. Tech.
ChEMBL_744294 (CHEMBL1772151)
Ki
132±n/a nM
Citation
 Meduna, SPSavall, BMCai, HEdwards, JPThurmond, RLMcGovern, PM Triamino pyrimidines and pyridines as histamine H(4) receptor modulators. Bioorg Med Chem Lett 21:3113-6 (2011)  
Target
Name:
Histamine H4 receptor
Synonyms:
AXOR35 GPCR105 HH4R HRH4 Histamine H4 receptor Histamine receptor (H3 and H4) SP9144
Type:
G Protein-Coupled Receptor (GPCR)
Mol. Mass.:
44517.02
Organism:
Homo sapiens (Human)
Description:
Binding assays were using CHO cells stably expressing hH4R receptors.
Residue:
390
  
Inhibitor
Name:
BDBM50343001
Synonyms:
6-(4-methylpiperazin-1-yl)-2-(pyrrolidin-1-yl)pyrimidin-4-amine | CHEMBL1770986
Type:
Small organic molecule
Emp. Form.:
C13H22N6
Mol. Mass.:
262.354
SMILES:
CN1CCN(CC1)c1cc(N)nc(n1)N1CCCC1
: