Target
Histamine H4 receptor
Ligand
BDBM50342981
Substrate
Meas. Tech.
ChEMBL_744295 (CHEMBL1772152)
EC50
>10000±n/a nM
Citation
 Meduna, SPSavall, BMCai, HEdwards, JPThurmond, RLMcGovern, PM Triamino pyrimidines and pyridines as histamine H(4) receptor modulators. Bioorg Med Chem Lett 21:3113-6 (2011)  
Target
Name:
Histamine H4 receptor
Synonyms:
AXOR35 GPCR105 HH4R HRH4 Histamine H4 receptor Histamine receptor (H3 and H4) SP9144
Type:
G Protein-Coupled Receptor (GPCR)
Mol. Mass.:
44517.02
Organism:
Homo sapiens (Human)
Description:
Binding assays were using CHO cells stably expressing hH4R receptors.
Residue:
390
  
Inhibitor
Name:
BDBM50342981
Synonyms:
4-(piperazin-1-yl)-6-(pyrrolidin-1-yl)pyrimidin-2-amine | CHEMBL1770160
Type:
Small organic molecule
Emp. Form.:
C12H20N6
Mol. Mass.:
248.3274
SMILES:
Nc1nc(cc(n1)N1CCNCC1)N1CCCC1
: