Target
Metabotropic glutamate receptor 1
Ligand
BDBM50333368
Substrate
Meas. Tech.
ChEMBL_744512 (CHEMBL1772533)
Ki
0.870000±n/a nM
Citation
 Yamasaki, TFujinaga, MYoshida, YKumata, KYui, JKawamura, KHatori, AFukumura, TZhang, MR Radiosynthesis and preliminary evaluation of 4-[18F]fluoro-N-[4-[6-(isopropylamino)pyrimidin-4-yl]-1,3-thiazol-2-yl]-N-methylbenzamide as a new positron emission tomography ligand for metabotropic glutamate receptor subtype 1. Bioorg Med Chem Lett 21:2998-3001 (2011)  
Target
Name:
Metabotropic glutamate receptor 1
Synonyms:
GPRC1A GRM1_HUMAN Metabotropic Glutamate 1a | metabotropic glutamate 1
Type:
Enzyme
Mol. Mass.:
132358.19
Organism:
Homo sapiens (Human)
Description:
Q13255
Residue:
1194
  
Inhibitor
Name:
BDBM50333368
Synonyms:
CHEMBL1645348 | [11C]-cis-(3-ethyl-2-methylquinolin-6-yl)(4-methoxycyclohexyl)methanone
Type:
Small organic molecule
Emp. Form.:
C20H25NO2
Mol. Mass.:
311.418
SMILES:
CCc1cc2cc(ccc2nc1C)C(=O)[C@@H]1CC[C@@H](CC1)OC
: