Target
Matrix metalloproteinase-9
Ligand
BDBM50343088
Substrate
Meas. Tech.
ChEMBL_744954 (CHEMBL1771913)
Ki
1700±n/a nM
Citation
 Barta, TEBecker, DPBedell, LJEaston, AMHockerman, SLKiefer, JMunie, GEMathis, KJLi, MHRico, JGVillamil, CIWilliams, JM MMP-13 selectivea-sulfone hydroxamates: a survey of P1' heterocyclic amide isosteres. Bioorg Med Chem Lett 21:2820-2 (2011)  
Target
Name:
Matrix metalloproteinase-9
Synonyms:
67 kDa matrix metalloproteinase-9 92 kDa gelatinase CLG4B Gelatinase B MMP9 Matrix metalloproteinase 9 (MMP-9) Matrix metalloproteinase-9 (MMP9)
Type:
Enzyme
Mol. Mass.:
78452.28
Organism:
Homo sapiens (Human)
Description:
P14780
Residue:
707
  
Inhibitor
Name:
BDBM50343088
Synonyms:
CHEMBL1771223 | N-hydroxy-4-(4-(3-(1-(4-(trifluoromethoxy)phenyl)-1H-tetrazol-5-yl)propoxy)phenylsulfonyl)tetrahydro-2H-pyran-4-carboxamide
Type:
Small organic molecule
Emp. Form.:
C23H24F3N5O7S
Mol. Mass.:
571.526
SMILES:
ONC(=O)C1(CCOCC1)S(=O)(=O)c1ccc(OCCCc2nnnn2-c2ccc(OC(F)(F)F)cc2)cc1
: