Target
Matrix metalloproteinase-14
Ligand
BDBM50343080
Substrate
Meas. Tech.
ChEMBL_744956 (CHEMBL1771915)
Ki
>10000±n/a nM
Citation
 Barta, TEBecker, DPBedell, LJEaston, AMHockerman, SLKiefer, JMunie, GEMathis, KJLi, MHRico, JGVillamil, CIWilliams, JM MMP-13 selectivea-sulfone hydroxamates: a survey of P1' heterocyclic amide isosteres. Bioorg Med Chem Lett 21:2820-2 (2011)  
Target
Name:
Matrix metalloproteinase-14
Synonyms:
MMP-14 MMP14 MT-MMP 1 MT1MMP Matrix Metalloproteinase-14 (MMP-14) Matrix metalloproteinase-14 Membrane-type matrix metalloproteinase 1 | Membrane-type-1 matrix metalloproteinase
Type:
Protein
Mol. Mass.:
65900.19
Organism:
Homo sapiens (Human)
Description:
P50281
Residue:
582
  
Inhibitor
Name:
BDBM50343080
Synonyms:
CHEMBL1771215 | N-hydroxy-4-(4-(3-(5-(4-(trifluoromethoxy)phenyl)-2H-tetrazol-2-yl)propoxy)phenylsulfonyl)tetrahydro-2H-pyran-4-carboxamide
Type:
Small organic molecule
Emp. Form.:
C23H24F3N5O7S
Mol. Mass.:
571.526
SMILES:
ONC(=O)C1(CCOCC1)S(=O)(=O)c1ccc(OCCCn2nnc(n2)-c2ccc(OC(F)(F)F)cc2)cc1
: