Target
72 kDa type IV collagenase
Ligand
BDBM50343079
Substrate
Meas. Tech.
ChEMBL_744950 (CHEMBL1771909)
IC50
48±n/a nM
Citation
 Barta, TEBecker, DPBedell, LJEaston, AMHockerman, SLKiefer, JMunie, GEMathis, KJLi, MHRico, JGVillamil, CIWilliams, JM MMP-13 selectivea-sulfone hydroxamates: a survey of P1' heterocyclic amide isosteres. Bioorg Med Chem Lett 21:2820-2 (2011)  
Target
Name:
72 kDa type IV collagenase
Synonyms:
72 kDa gelatinase CLG4A Gelatinase A (MMP-2) MMP2_HUMAN Matrix metalloproteinase-2 (MMP 2) Matrix metalloproteinases 2 (MMP-2) | TBE-1
Type:
Enzyme
Mol. Mass.:
73870.36
Organism:
Homo sapiens (Human)
Description:
P08253
Residue:
660
  
Inhibitor
Name:
BDBM50343079
Synonyms:
CHEMBL1771214 | N-hydroxy-4-(4-(3-(5-(4-methoxyphenyl)-2H-tetrazol-2-yl)propoxy)phenylsulfonyl)tetrahydro-2H-pyran-4-carboxamide
Type:
Small organic molecule
Emp. Form.:
C23H27N5O7S
Mol. Mass.:
517.555
SMILES:
COc1ccc(cc1)-c1nnn(CCCOc2ccc(cc2)S(=O)(=O)C2(CCOCC2)C(=O)NO)n1
: