Target
Neutrophil collagenase
Ligand
BDBM50343082
Substrate
Meas. Tech.
ChEMBL_744953 (CHEMBL1771912)
Ki
240±n/a nM
Citation
 Barta, TEBecker, DPBedell, LJEaston, AMHockerman, SLKiefer, JMunie, GEMathis, KJLi, MHRico, JGVillamil, CIWilliams, JM MMP-13 selectivea-sulfone hydroxamates: a survey of P1' heterocyclic amide isosteres. Bioorg Med Chem Lett 21:2820-2 (2011)  
Target
Name:
Neutrophil collagenase
Synonyms:
CLG1 MMP8 Matrix metalloproteinase-8 PMNL collagenase | PMNL-CL
Type:
Enzyme
Mol. Mass.:
53413.48
Organism:
Homo sapiens (Human)
Description:
P22894
Residue:
467
  
Inhibitor
Name:
BDBM50343082
Synonyms:
CHEMBL1771217 | N-hydroxy-4-(4-(3-(5-(5-methylpyridin-2-yl)-2H-tetrazol-2-yl)propoxy)phenylsulfonyl)tetrahydro-2H-pyran-4-carboxamide
Type:
Small organic molecule
Emp. Form.:
C22H26N6O6S
Mol. Mass.:
502.543
SMILES:
Cc1ccc(nc1)-c1nnn(CCCOc2ccc(cc2)S(=O)(=O)C2(CCOCC2)C(=O)NO)n1
: