Target
Acetylcholinesterase
Ligand
BDBM31904
Substrate
Meas. Tech.
ChEMBL_745440 (CHEMBL1775596)
IC50
32000±n/a nM
Citation
 Belluti, FBartolini, MBottegoni, GBisi, ACavalli, AAndrisano, VRampa, A Benzophenone-based derivatives: a novel series of potent and selective dual inhibitors of acetylcholinesterase and acetylcholinesterase-induced beta-amyloid aggregation. Eur J Med Chem 46:1682-93 (2011)  
Target
Name:
Acetylcholinesterase
Synonyms:
ACES_HUMAN Acetylcholinesterase (AChE) | Acetylcholinesterase (human AChE)
Type:
Enzyme
Mol. Mass.:
67792.70
Organism:
Homo sapiens (Human)
Description:
P22303
Residue:
614
  
Inhibitor
Name:
BDBM31904
Synonyms:
CHEMBL345124 Propidium Iodide, 2 | propidium iodide
Type:
Small organic molecule
Emp. Form.:
C27H34N4
Mol. Mass.:
414.5846
SMILES:
CC[N+](C)(CC)CCCn1c(-c2ccccc2)c2cc(N)ccc2c2ccc(=[NH2+])cc12
: