Target
Uracil-DNA glycosylase
Ligand
BDBM50343395
Substrate
Meas. Tech.
ChEMBL_747132 (CHEMBL1777498)
IC50
34100±n/a nM
Citation
 Nuth, MHuang, LSaw, YLSchormann, NChattopadhyay, DRicciardi, RP Identification of inhibitors that block vaccinia virus infection by targeting the DNA synthesis processivity factor D4. J Med Chem 54:3260-7 (2011)  
Target
Name:
Uracil-DNA glycosylase
Synonyms:
OPG116 UNG | UNG_VACCW
Type:
PROTEIN
Mol. Mass.:
25071.48
Organism:
Vaccinia virus (strain Western Reserve) (VACV) (Vaccinia virus (strainWR))
Description:
ChEMBL_747132
Residue:
218
  
Inhibitor
Name:
BDBM50343395
Synonyms:
10-(cyclohexylamino)-12-[(2-hydroxyethyl)amino]-15-oxa-14-azatetracyclohexadeca-1(16),2,4,6,9,11,13-heptaen-8-one | CHEMBL1774936
Type:
Small organic molecule
Emp. Form.:
C22H25N3O3
Mol. Mass.:
379.4522
SMILES:
OCCN=C1CC(NC2CCCCC2)c2c(O)c3ccccc3c3onc1c23
: