Target
Serine/threonine-protein kinase PLK2
Ligand
BDBM50343559
Substrate
Meas. Tech.
ChEMBL_747146 (CHEMBL1777512)
IC50
>10000±n/a nM
Citation
 Beria, IBossi, RTBrasca, MGCaruso, MCeccarelli, WFachin, GFasolini, MForte, BFiorentini, FPesenti, EPezzetta, DPosteri, HScolaro, ARe Depaolini, SValsasina, B NMS-P937, a 4,5-dihydro-1H-pyrazolo[4,3-h]quinazoline derivative as potent and selective Polo-like kinase 1 inhibitor. Bioorg Med Chem Lett 21:2969-74 (2011)  
Target
Name:
Serine/threonine-protein kinase PLK2
Synonyms:
PLK2 Polo-Like Kinase 2 Serine/threonine-protein kinase PLK2 Serum-inducible kinase
Type:
Serine/threonine-protein kinase
Mol. Mass.:
78259.87
Organism:
Homo sapiens (Human)
Description:
Full-length human PLK2 was expressed as GST-fusion protein using baculovirus expression system. GST-PLK2 was purified by using glutathione sepharose chromatography.
Residue:
685
  
Inhibitor
Name:
BDBM50343559
Synonyms:
1-(2-HYDROXYETHYL)-8-[[5-(4-METHYLPIPERAZIN-1-YL)-2-(TRIFLUOROMETHOXY)PHENYL]AMINO]-4,5-DIHYDROPYRIMIDO[5,4-G]INDAZOLE-3-CARBOXAMIDE CHEMBL1738758
Type:
Small organic molecule
Emp. Form.:
C24H27F3N8O3
Mol. Mass.:
532.5182
SMILES:
CN1CCN(CC1)c1ccc(OC(F)(F)F)c(Nc2ncc3CCc4c(nn(CCO)c4-c3n2)C(N)=O)c1
: