Target
Serine/threonine-protein kinase PLK2
Ligand
BDBM50343565
Substrate
Meas. Tech.
ChEMBL_747146 (CHEMBL1777512)
IC50
762±n/a nM
Citation
 Beria, IBossi, RTBrasca, MGCaruso, MCeccarelli, WFachin, GFasolini, MForte, BFiorentini, FPesenti, EPezzetta, DPosteri, HScolaro, ARe Depaolini, SValsasina, B NMS-P937, a 4,5-dihydro-1H-pyrazolo[4,3-h]quinazoline derivative as potent and selective Polo-like kinase 1 inhibitor. Bioorg Med Chem Lett 21:2969-74 (2011)  
Target
Name:
Serine/threonine-protein kinase PLK2
Synonyms:
PLK2 Polo-Like Kinase 2 Serine/threonine-protein kinase PLK2 Serum-inducible kinase
Type:
Serine/threonine-protein kinase
Mol. Mass.:
78259.87
Organism:
Homo sapiens (Human)
Description:
Full-length human PLK2 was expressed as GST-fusion protein using baculovirus expression system. GST-PLK2 was purified by using glutathione sepharose chromatography.
Residue:
685
  
Inhibitor
Name:
BDBM50343565
Synonyms:
1-methyl-8-(5-(pyrrolidin-2-ylamino)-2-(trifluoromethoxy)phenylamino)-4,5-dihydro-1H-pyrazolo[4,3-h]quinazoline-3-carboxamide | CHEMBL1774332
Type:
Small organic molecule
Emp. Form.:
C22H23F3N8O2
Mol. Mass.:
488.4656
SMILES:
Cn1nc(C(N)=O)c2CCc3cnc(Nc4cc(NC5CCCN5)ccc4OC(F)(F)F)nc3-c12
: