Target
Serine/threonine-protein kinase mTOR
Ligand
BDBM50343766
Substrate
Meas. Tech.
ChEMBL_747578 (CHEMBL1777159)
Ki
1.6±n/a nM
Citation
 Cohen, FBergeron, PBlackwood, EBowman, KKChen, HDipasquale, AGEpler, JAKoehler, MFLau, KLewis, CLiu, LLy, CQMalek, SNonomiya, JOrtwine, DFPei, ZRobarge, KDSideris, STrinh, LTruong, TWu, JZhao, XLyssikatos, JP Potent, selective, and orally bioavailable inhibitors of mammalian target of rapamycin (mTOR) kinase based on a quaternary substituted dihydrofuropyrimidine. J Med Chem 54:3426-35 (2011)  
Target
Name:
Serine/threonine-protein kinase mTOR
Synonyms:
FK506-binding protein 12-rapamycin complex-associated protein 1 FRAP FRAP1 MTOR Mammalian Target of Rapamycin (mTOR) RAFT1 Rapamycin and FKBP12 target 1 Serine/threonine-protein kinase (mTOR) | mTORC2
Type:
Rapamycin target protein
Mol. Mass.:
288917.12
Organism:
Homo sapiens (Human)
Description:
P42345
Residue:
2549
  
Inhibitor
Name:
BDBM50343766
Synonyms:
(S)-1-(4-(7,7-Dimethyl-4-(3-methylmorpholino)-5,7-dihydrofuro[3,4-d]pyrimidin-2-yl)phenyl)-3-(2-hydroxyethyl)urea | CHEMBL1774355
Type:
Small organic molecule
Emp. Form.:
C22H29N5O4
Mol. Mass.:
427.4968
SMILES:
C[C@H]1COCCN1c1nc(nc2c1COC2(C)C)-c1ccc(NC(=O)NCCO)cc1
: