Target
Tyrosine-protein kinase Yes
Ligand
BDBM50343938
Substrate
Meas. Tech.
ChEMBL_748335 (CHEMBL1781459)
Ki
24±n/a nM
Citation
 Ando, RIkegami, HSakiyama, MOoike, SHayashi, MFujino, YAbe, DNakamura, HMishina, TKato, HIwase, YTomozane, HMorioka, M 3-Cyano-6-(5-methyl-3-pyrazoloamino)pyridines: selective Aurora A kinase inhibitors. Bioorg Med Chem Lett 20:4709-11 (2010)  
Target
Name:
Tyrosine-protein kinase Yes
Synonyms:
Proto-oncogene c-Yes YES YES_HUMAN | p61-yes
Type:
Protein
Mol. Mass.:
60801.54
Organism:
Homo sapiens (Human)
Description:
P07947
Residue:
543
  
Inhibitor
Name:
BDBM50343938
Synonyms:
CHEMBL1778662 | rac-2-(6-hydroxy-6-methylheptan-2-ylamino)-4-methyl-6-(5-methyl-1H-pyrazol-3-ylamino)nicotinonitrile hydrochloride
Type:
Small organic molecule
Emp. Form.:
C19H28N6O
Mol. Mass.:
356.4652
SMILES:
CC(CCCC(C)(C)O)Nc1nc(Nc2cc(C)n[nH]2)cc(C)c1C#N
: