Target
Cytochrome P450 1A1
Ligand
BDBM50009001
Substrate
Meas. Tech.
ChEMBL_748492 (CHEMBL1780345)
Ki
1220±n/a nM
Citation
 Androutsopoulos, VPPapakyriakou, AVourloumis, DSpandidos, DA Comparative CYP1A1 and CYP1B1 substrate and inhibitor profile of dietary flavonoids. Bioorg Med Chem 19:2842-9 (2011)  
Target
Name:
Cytochrome P450 1A1
Synonyms:
CP1A1_HUMAN CYPIA1 Cytochrome P450 1A1 P450 form 6 P450-P1
Type:
Protein
Mol. Mass.:
58177.23
Organism:
Homo sapiens (Human)
Description:
P04798
Residue:
512
  
Inhibitor
Name:
BDBM50009001
Synonyms:
5,6,7-Trihydroxyflavone Baicalein Baicalein, 8 US10252984, Table 2.33
Type:
Small organic molecule
Emp. Form.:
C15H10O5
Mol. Mass.:
270.2369
SMILES:
Oc1cc2oc(cc(=O)c2c(O)c1O)-c1ccccc1
: