Target
Cytochrome P450 1A1
Ligand
BDBM23415
Substrate
Meas. Tech.
ChEMBL_748492 (CHEMBL1780345)
Ki
45±n/a nM
Citation
 Androutsopoulos, VPPapakyriakou, AVourloumis, DSpandidos, DA Comparative CYP1A1 and CYP1B1 substrate and inhibitor profile of dietary flavonoids. Bioorg Med Chem 19:2842-9 (2011)  
Target
Name:
Cytochrome P450 1A1
Synonyms:
CP1A1_HUMAN CYPIA1 Cytochrome P450 1A1 P450 form 6 P450-P1
Type:
Protein
Mol. Mass.:
58177.23
Organism:
Homo sapiens (Human)
Description:
P04798
Residue:
512
  
Inhibitor
Name:
BDBM23415
Synonyms:
5,7-dihydroxy-2-(4-methoxyphenyl)-4H-chromen-4-one CHEMBL243664
Type:
flavone
Emp. Form.:
C16H12O5
Mol. Mass.:
284.2635
SMILES:
COc1ccc(cc1)-c1cc(=O)c2c(O)cc(O)cc2o1
: