Target
B1 bradykinin receptor
Ligand
BDBM50344114
Substrate
Meas. Tech.
ChEMBL_748611 (CHEMBL1780464)
Ki
2.4±n/a nM
Citation
 Chen, JJNguyen, TD'Amico, DCQian, WHuman, JAya, TBiswas, KFotsch, CHan, NLiu, QNishimura, NPeterkin, TAYang, KZhu, JRiahi, BBHungate, RWAndersen, NGColyer, JTFaul, MMKamassah, AWang, JJona, JKumar, GJohnson, EAskew, BC 3-Oxo-2-piperazinyl acetamides as potent bradykinin B1 receptor antagonists for the treatment of pain and inflammation. Bioorg Med Chem Lett 21:3384-9 (2011)  
Target
Name:
B1 bradykinin receptor
Synonyms:
B1 BRADYKININ B1R BK-1 receptor BRADYB1 | Bradykinin B1 receptor
Type:
Enzyme
Mol. Mass.:
40508.87
Organism:
Homo sapiens (Human)
Description:
P46663
Residue:
353
  
Inhibitor
Name:
BDBM50344114
Synonyms:
CHEMBL1777972 | N-((R)-6-((4-methylpiperazin-1-yl)methyl)-1,2,3,4-tetrahydronaphthalen-1-yl)-2-((R)-3-oxo-1-tosylpiperazin-2-yl)acetamide
Type:
Small organic molecule
Emp. Form.:
C29H39N5O4S
Mol. Mass.:
553.716
SMILES:
CN1CCN(Cc2ccc3[C@@H](CCCc3c2)NC(=O)C[C@H]2N(CCNC2=O)S(=O)(=O)c2ccc(C)cc2)CC1
: