Target
Natriuretic peptides A
Ligand
BDBM50344195
Substrate
Meas. Tech.
ChEMBL_748204 (CHEMBL1780285)
IC50
195±n/a nM
Citation
 Glossop, MSBazin, RJDack, KNFox, DNMacDonald, GAMills, MOwen, DRPhillips, CReeves, KARinger, TJStrang, RSWatson, CA Synthesis and evaluation of heteroarylalanine diacids as potent and selective neutral endopeptidase inhibitors. Bioorg Med Chem Lett 21:3404-6 (2011)  
Target
Name:
Natriuretic peptides A
Synonyms:
ANF ANP Atrial natriuretic peptide CDP NPPA PND | Prepronatriodilatin
Type:
PROTEIN
Mol. Mass.:
16393.93
Organism:
Homo sapiens (Human)
Description:
ChEMBL_748204
Residue:
151
  
Inhibitor
Name:
BDBM50344195
Synonyms:
(S)-2-(1-((S)-1-carboxy-2-(5-(4-chlorophenyl)oxazol-2-yl)ethylcarbamoyl)cyclopentylamino)-4-methoxybutanoic acid | CHEMBL1778534
Type:
Small organic molecule
Emp. Form.:
C23H28ClN3O7
Mol. Mass.:
493.937
SMILES:
COCC[C@H](NC1(CCCC1)C(=O)N[C@@H](Cc1ncc(o1)-c1ccc(Cl)cc1)C(O)=O)C(O)=O
: