Target
Metabotropic glutamate receptor 5
Ligand
BDBM50344383
Substrate
Meas. Tech.
ChEMBL_748645 (CHEMBL1780498)
Ki
2170±n/a nM
Citation
 Sams, AGMikkelsen, GKBrodbeck, RMPu, XRitzén, A Efficacy switching SAR of mGluR5 allosteric modulators: highly potent positive and negative modulators from one chemotype. Bioorg Med Chem Lett 21:3407-10 (2011)  
Target
Name:
Metabotropic glutamate receptor 5
Synonyms:
GPRC1E GRM5_HUMAN metabotropic glutamate 5 | metabotropic glutamate 5a
Type:
Enzyme
Mol. Mass.:
132484.72
Organism:
Homo sapiens (Human)
Description:
Residue:
1212
  
Inhibitor
Name:
BDBM50344383
Synonyms:
6-methyl-2-(thiophen-2-ylethynyl)-7,8-dihydro-1,6-naphthyridin-5(6H)-one | CHEMBL1779857
Type:
Small organic molecule
Emp. Form.:
C15H12N2OS
Mol. Mass.:
268.334
SMILES:
CN1CCc2nc(ccc2C1=O)C#Cc1cccs1
: