Target
RAF proto-oncogene serine/threonine-protein kinase
Ligand
BDBM50344541
Substrate
Meas. Tech.
ChEMBL_747956 (CHEMBL1781333)
IC50
1±n/a nM
Citation
 Ramurthy, SAikawa, MAmiri, PCostales, AHashash, AJansen, JMLin, SMa, SRenhowe, PAShafer, CMSubramanian, SSung, LVerhagen, J Design and synthesis of 5,6-fused heterocyclic amides as Raf kinase inhibitors. Bioorg Med Chem Lett 21:3286-9 (2011)  
Target
Name:
RAF proto-oncogene serine/threonine-protein kinase
Synonyms:
C-Raf Protein Kinase RAF RAF1 Raf-1 Serine/threonine-protein kinase C-Raf | cRaf
Type:
Serine/threonine-protein kinase
Mol. Mass.:
73082.52
Organism:
Homo sapiens (Human)
Description:
P04049
Residue:
648
  
Inhibitor
Name:
BDBM50344541
Synonyms:
4-(2-(4-ethylphenylamino)benzo[d]oxazol-5-yloxy)-N-methylpicolinamide | CHEMBL1778394
Type:
Small organic molecule
Emp. Form.:
C22H20N4O3
Mol. Mass.:
388.4192
SMILES:
CCc1ccc(Nc2nc3cc(Oc4ccnc(c4)C(=O)NC)ccc3o2)cc1
: