Target
MAP kinase-activated protein kinase 2
Ligand
BDBM30185
Substrate
Meas. Tech.
ChEMBL_749131 (CHEMBL1780728)
EC50
49±n/a nM
Citation
 Barf, TKaptein, Ade Wilde, Svan der Heijden, Rvan Someren, RDemont, DSchultz-Fademrecht, CVersteegh, Jvan Zeeland, MSeegers, NKazemier, Bvan de Kar, Bvan Hoek, Mde Roos, JKlop, HSmeets, RHofstra, CHornberg, JOubrie, A Structure-based lead identification of ATP-competitive MK2 inhibitors. Bioorg Med Chem Lett 21:3818-22 (2011)  
Target
Name:
MAP kinase-activated protein kinase 2
Synonyms:
MAP kinase-activated protein kinase 2 (MAPKAPK2) MAP kinase-activated protein kinase 2 (p38/MK2) MAPK-activated protein kinase 2 MAPKAP kinase 2 MAPKAPK2 | MK2
Type:
Serine/threonine-protein kinase
Mol. Mass.:
45579.87
Organism:
Homo sapiens (Human)
Description:
P49137
Residue:
400
  
Inhibitor
Name:
BDBM30185
Synonyms:
CHEMBL226403 | Pyrrolopyridine, 16
Type:
Small organic molecule
Emp. Form.:
C21H16N4O
Mol. Mass.:
340.3779
SMILES:
O=C1NCCc2[nH]c(cc12)-c1ccnc(c1)-c1cnc2ccccc2c1
: