Target
Broad substrate specificity ATP-binding cassette transporter ABCG2
Ligand
BDBM50293015
Substrate
Meas. Tech.
ChEMBL_749177 (CHEMBL1780905)
IC50
59±n/a nM
Citation
 Puentes, COHöcherl, PKühnle, MBauer, SBürger, KBernhardt, GBuschauer, AKönig, B Solid phase synthesis of tariquidar-related modulators of ABC transporters preferring breast cancer resistance protein (ABCG2). Bioorg Med Chem Lett 21:3654-7 (2011)  
Target
Name:
Broad substrate specificity ATP-binding cassette transporter ABCG2
Synonyms:
ABCG2 ABCP ATP-binding cassette sub-family G member 2 ATP-binding cassette, sub-family G, member 2 BCRP1 CDw338 Mitoxantrone resistance-associated protein Urate exporter
Type:
Multi-pass membrane protein; monomer or homodimer; disulfide-linked
Mol. Mass.:
72329.48
Organism:
Homo sapiens (Human)
Description:
Q9UNQ0
Residue:
655
  
Inhibitor
Name:
BDBM50293015
Synonyms:
CHEMBL502503 | Methyl 4-((4-(2-(6,7-Dimethoxy-1,2,3,4-tetrahydroisoquinolin-2-yl)ethyl)phenyl)amino-carbonyl)-2-(quinoline-2-carbonylamino)benzoate
Type:
Small organic molecule
Emp. Form.:
C38H36N4O6
Mol. Mass.:
644.7156
SMILES:
COC(=O)c1ccc(cc1NC(=O)c1ccc2ccccc2n1)C(=O)Nc1ccc(CCN2CCc3cc(OC)c(OC)cc3C2)cc1
: