Target
Broad substrate specificity ATP-binding cassette transporter ABCG2
Ligand
BDBM50344758
Substrate
Meas. Tech.
ChEMBL_749177 (CHEMBL1780905)
IC50
>50000±n/a nM
Citation
 Puentes, COHöcherl, PKühnle, MBauer, SBürger, KBernhardt, GBuschauer, AKönig, B Solid phase synthesis of tariquidar-related modulators of ABC transporters preferring breast cancer resistance protein (ABCG2). Bioorg Med Chem Lett 21:3654-7 (2011)  
Target
Name:
Broad substrate specificity ATP-binding cassette transporter ABCG2
Synonyms:
ABCG2 ABCP ATP-binding cassette sub-family G member 2 ATP-binding cassette, sub-family G, member 2 BCRP1 CDw338 Mitoxantrone resistance-associated protein Urate exporter
Type:
Multi-pass membrane protein; monomer or homodimer; disulfide-linked
Mol. Mass.:
72329.48
Organism:
Homo sapiens (Human)
Description:
Q9UNQ0
Residue:
655
  
Inhibitor
Name:
BDBM50344758
Synonyms:
CHEMBL1779521 | N-{4-[2-(7-Methoxy-6-{2-[2-(2-methoxy-ethoxy)-ethoxy]-ethoxy}-3,4-dihydro-1H-isoquinolin-2-yl)-ethyl]-phenyl}-2-[(quinoline-6-carbonyl)-amino]-terephthalamic acid trifluoroacetic acid
Type:
Small organic molecule
Emp. Form.:
C43H46N4O9
Mol. Mass.:
762.8467
SMILES:
COCCOCCOCCOc1cc2CCN(CCc3ccc(NC(=O)c4ccc(C(O)=O)c(NC(=O)c5ccc6ncccc6c5)c4)cc3)Cc2cc1OC
: