Target
Acetylcholinesterase
Ligand
BDBM50345203
Substrate
Meas. Tech.
ChEMBL_751250 (CHEMBL1787618)
IC50
12.5±n/a nM
Citation
 Luo, WLi, YPHe, YHuang, SLLi, DGu, LQHuang, ZS Synthesis and evaluation of heterobivalent tacrine derivatives as potential multi-functional anti-Alzheimer agents. Eur J Med Chem 46:2609-16 (2011)  
Target
Name:
Acetylcholinesterase
Synonyms:
ACES_ELEEL Acetylcholinesterase (EeAChE) | ache
Type:
Enzyme
Mol. Mass.:
71812.79
Organism:
Electrophorus electricus (Electric eel)
Description:
Residue:
633
  
Inhibitor
Name:
BDBM50345203
Synonyms:
2-((8-(1,2,3,4-Tetrahydroacridin-9-ylamino)octylamino)methyl)phenol | CHEMBL1783239
Type:
Small organic molecule
Emp. Form.:
C28H37N3O
Mol. Mass.:
431.6129
SMILES:
Oc1ccccc1CNCCCCCCCCNc1c2CCCCc2nc2ccccc12
: