Target
P2Y purinoceptor 4
Ligand
BDBM50341879
Substrate
Meas. Tech.
ChEMBL_751027 (CHEMBL1786812)
EC50
130±n/a nM
Citation
 Maruoka, HJayasekara, MPBarrett, MOFranklin, DAde Castro, SKim, NCostanzi, SHarden, TKJacobson, KA Pyrimidine nucleotides with 4-alkyloxyimino and terminal tetraphosphated-ester modifications as selective agonists of the P2Y(4) receptor. J Med Chem 54:4018-33 (2011)  
Target
Name:
P2Y purinoceptor 4
Synonyms:
NRU P2RY4 P2Y purinoceptor 4 Pyrimidinergic receptor P2Y4 Uridine nucleotide receptor
Type:
PROTEIN
Mol. Mass.:
40977.17
Organism:
Homo sapiens (Human)
Description:
ChEMBL_751027
Residue:
365
  
Inhibitor
Name:
BDBM50341879
Synonyms:
CHEMBL1767408 | Diquafosol
Type:
Small organic molecule
Emp. Form.:
C18H22N4O23P4
Mol. Mass.:
786.2775
SMILES:
O[C@H]1[C@@H](O)[C@@H](O[C@@H]1COP([O-])(=O)OP([O-])(=O)OP([O-])(=O)OP([O-])(=O)OC[C@H]1O[C@H]([C@H](O)[C@@H]1O)n1ccc(=O)[nH]c1=O)n1ccc(=O)[nH]c1=O
: