Target
P2Y purinoceptor 4
Ligand
BDBM50345491
Substrate
Meas. Tech.
ChEMBL_751027 (CHEMBL1786812)
EC50
183±n/a nM
Citation
 Maruoka, HJayasekara, MPBarrett, MOFranklin, DAde Castro, SKim, NCostanzi, SHarden, TKJacobson, KA Pyrimidine nucleotides with 4-alkyloxyimino and terminal tetraphosphated-ester modifications as selective agonists of the P2Y(4) receptor. J Med Chem 54:4018-33 (2011)  
Target
Name:
P2Y purinoceptor 4
Synonyms:
NRU P2RY4 P2Y purinoceptor 4 Pyrimidinergic receptor P2Y4 Uridine nucleotide receptor
Type:
PROTEIN
Mol. Mass.:
40977.17
Organism:
Homo sapiens (Human)
Description:
ChEMBL_751027
Residue:
365
  
Inhibitor
Name:
BDBM50345491
Synonyms:
CHEMBL1784885 | Uridine-5'-allose-1'-tetraphosphate
Type:
Small organic molecule
Emp. Form.:
C15H26N2O23P4
Mol. Mass.:
726.2616
SMILES:
OC[C@H]1O[C@H](OP(O)(=O)OP(O)(=O)OP(O)(=O)OP(O)(=O)OC[C@H]2O[C@H]([C@H](O)[C@@H]2O)n2ccc(=O)[nH]c2=O)[C@H](O)[C@H](O)[C@@H]1O
: