Target
P2Y purinoceptor 6
Ligand
BDBM50270545
Substrate
Meas. Tech.
ChEMBL_751015 (CHEMBL1786670)
EC50
7830±n/a nM
Citation
 Maruoka, HJayasekara, MPBarrett, MOFranklin, DAde Castro, SKim, NCostanzi, SHarden, TKJacobson, KA Pyrimidine nucleotides with 4-alkyloxyimino and terminal tetraphosphated-ester modifications as selective agonists of the P2Y(4) receptor. J Med Chem 54:4018-33 (2011)  
Target
Name:
P2Y purinoceptor 6
Synonyms:
P2RY6 P2Y purinoceptor 6 Pyrimidinergic receptor P2Y6
Type:
PROTEIN
Mol. Mass.:
36452.29
Organism:
Homo sapiens (Human)
Description:
ChEMBL_1511151
Residue:
328
  
Inhibitor
Name:
BDBM50270545
Synonyms:
CHEMBL499138 | Uridine-5'-glucose-1'-tetraphosphate
Type:
Small organic molecule
Emp. Form.:
C15H26N2O23P4
Mol. Mass.:
726.2616
SMILES:
OC[C@H]1O[C@H](OP(O)(=O)OP(O)(=O)OP(O)(=O)OP(O)(=O)OC[C@H]2O[C@H]([C@H](O)[C@@H]2O)n2ccc(=O)[nH]c2=O)[C@H](O)[C@@H](O)[C@@H]1O
: