Target
A disintegrin and metalloproteinase with thrombospondin motifs 5
Ligand
BDBM50345535
Substrate
Meas. Tech.
ChEMBL_751101 (CHEMBL1787038)
IC50
79±n/a nM
Citation
 De Savi, CPape, ASawyer, YMilne, DDavies, CCumming, JGTing, ALamont, SSmith, PDTart, JPage, KMoore, P Orally active achiral N-hydroxyformamide inhibitors of ADAM-TS4 (aggrecanase-1) and ADAM-TS5 (aggrecanase-2) for the treatment of osteoarthritis. Bioorg Med Chem Lett 21:3301-6 (2011)  
Target
Name:
A disintegrin and metalloproteinase with thrombospondin motifs 5
Synonyms:
A disintegrin and metalloproteinase with thrombospondin motifs 5 (ADAMTS-5) ADAMTS5 ATS5_HUMAN Metalloproteinase with thrombospondin motifs 5 (ADAMTS-5)
Type:
Enzyme
Mol. Mass.:
101769.09
Organism:
Homo sapiens (Human)
Description:
Q9UNA0
Residue:
930
  
Inhibitor
Name:
BDBM50345535
Synonyms:
CHEMBL1784371 US10322143, Compound 15e
Type:
Small organic molecule
Emp. Form.:
C27H38F3N3O5S
Mol. Mass.:
573.668
SMILES:
Cc1cc(ccc1CCC1CCN(CC1)S(=O)(=O)CC1(CCN(CC1)C(=O)C1CCC1)N(O)C=O)C(F)(F)F
: