Target
Tyrosine-protein kinase ABL1
Ligand
BDBM50345587
Substrate
Meas. Tech.
ChEMBL_751378 (CHEMBL1785339)
IC50
3.6±n/a nM
Citation
 Thomas, MHuang, WSWen, DZhu, XWang, YMetcalf, CALiu, SChen, IRomero, JZou, DSundaramoorthi, RLi, FQi, JCai, LZhou, TCommodore, LXu, QKeats, JWang, FWardwell, SNing, YSnodgrass, JTBroudy, MIRussian, KIuliucci, JRivera, VMSawyer, TKDalgarno, DCClackson, TShakespeare, WC Discovery of 5-(arenethynyl) hetero-monocyclic derivatives as potent inhibitors of BCR-ABL including the T315I gatekeeper mutant. Bioorg Med Chem Lett 21:3743-8 (2011)  
Target
Name:
Tyrosine-protein kinase ABL1
Synonyms:
ABL ABL1_HUMAN JTK7 Proto-oncogene tyrosine-protein kinase ABL1 Tyrosine-protein kinase ABL V-abl Abelson murine leukemia viral oncogene homolog 1 p150 | tyrosine-protein kinase ABL1 isoform a
Type:
Enzyme
Mol. Mass.:
122897.30
Organism:
Homo sapiens (Human)
Description:
P00519
Residue:
1130
  
Inhibitor
Name:
BDBM50345587
Synonyms:
1-methyl-5-((2-methyl-5-(4-((4-methylpiperazin-1-yl)methyl)-3-(trifluoromethyl)phenylcarbamoyl)phenyl)ethynyl)-1H-imidazole-2-carboxamide | CHEMBL1784634
Type:
Small organic molecule
Emp. Form.:
C28H29F3N6O2
Mol. Mass.:
538.5641
SMILES:
CN1CCN(Cc2ccc(NC(=O)c3ccc(C)c(c3)C#Cc3cnc(C(N)=O)n3C)cc2C(F)(F)F)CC1
: