Target
Breast cancer type 1 susceptibility protein
Ligand
BDBM50345625
Substrate
Meas. Tech.
ChEMBL_752252 (CHEMBL1785941)
IC50
52800±n/a nM
Citation
 Yuan, ZKumar, EAKizhake, SNatarajan, A Structure-activity relationship studies to probe the phosphoprotein binding site on the carboxy terminal domains of the breast cancer susceptibility gene 1. J Med Chem 54:4264-8 (2011)  
Target
Name:
Breast cancer type 1 susceptibility protein
Synonyms:
BRCA1 RNF53
Type:
PROTEIN
Mol. Mass.:
207672.68
Organism:
Homo sapiens (Human)
Description:
ChEMBL_812733
Residue:
1863
  
Inhibitor
Name:
BDBM50345625
Synonyms:
2-((S)-2-acetamido-3-((S)-2-((2S,3R)-1-((S)-1-amino-1-oxo-3-phenylpropan-2-ylamino)-3-hydroxy-1-oxobutan-2-ylcarbamoyl)pyrrolidin-1-yl)-3-oxopropyl)malonic acid | CHEMBL1784772
Type:
Small organic molecule
Emp. Form.:
C26H35N5O10
Mol. Mass.:
577.5836
SMILES:
C[C@@H](O)[C@H](NC(=O)[C@@H]1CCCN1C(=O)[C@H](CC(C(O)=O)C(O)=O)NC(C)=O)C(=O)N[C@@H](Cc1ccccc1)C(N)=O
: