Target
Breast cancer type 1 susceptibility protein
Ligand
BDBM50345638
Substrate
Meas. Tech.
ChEMBL_752252 (CHEMBL1785941)
IC50
>250000±n/a nM
Citation
 Yuan, ZKumar, EAKizhake, SNatarajan, A Structure-activity relationship studies to probe the phosphoprotein binding site on the carboxy terminal domains of the breast cancer susceptibility gene 1. J Med Chem 54:4264-8 (2011)  
Target
Name:
Breast cancer type 1 susceptibility protein
Synonyms:
BRCA1 RNF53
Type:
PROTEIN
Mol. Mass.:
207672.68
Organism:
Homo sapiens (Human)
Description:
ChEMBL_812733
Residue:
1863
  
Inhibitor
Name:
BDBM50345638
Synonyms:
(2R,5R,8R,11R)-11-benzyl-2-carbamoyl-8-((S)-1-hydroxyethyl)-5-methyl-4,7,10,13-tetraoxo-3,6,9,12-tetraazatetradecyl dihydrogen phosphate | CHEMBL1784782
Type:
Small organic molecule
Emp. Form.:
C21H32N5O10P
Mol. Mass.:
545.48
SMILES:
C[C@H](O)[C@@H](NC(=O)[C@@H](Cc1ccccc1)NC(C)=O)C(=O)N[C@H](C)C(=O)N[C@H](COP(O)(O)=O)C(N)=O
: