Target
Breast cancer type 1 susceptibility protein
Ligand
BDBM50345640
Substrate
Meas. Tech.
ChEMBL_752252 (CHEMBL1785941)
IC50
1000±n/a nM
Citation
 Yuan, ZKumar, EAKizhake, SNatarajan, A Structure-activity relationship studies to probe the phosphoprotein binding site on the carboxy terminal domains of the breast cancer susceptibility gene 1. J Med Chem 54:4264-8 (2011)  
Target
Name:
Breast cancer type 1 susceptibility protein
Synonyms:
BRCA1 RNF53
Type:
PROTEIN
Mol. Mass.:
207672.68
Organism:
Homo sapiens (Human)
Description:
ChEMBL_812733
Residue:
1863
  
Inhibitor
Name:
BDBM50345640
Synonyms:
(S)-2-((2S,3R)-2-((S)-1-((S)-2-acetamido-3-(phosphonooxy)propanoyl)pyrrolidine-2-carboxamido)-3-hydroxybutanamido)-3-phenylpropanoic acid | CHEMBL1784784
Type:
Small organic molecule
Emp. Form.:
C23H33N4O11P
Mol. Mass.:
572.5021
SMILES:
C[C@@H](O)[C@H](NC(=O)[C@@H]1CCCN1C(=O)[C@H](COP(O)(O)=O)NC(C)=O)C(=O)N[C@@H](Cc1ccccc1)C(O)=O
: