Target
Metabotropic glutamate receptor 1
Ligand
BDBM50345939
Substrate
Meas. Tech.
ChEMBL_749914 (CHEMBL1786744)
Ki
3.2±n/a nM
Citation
 Sasikumar, TKQiang, LBurnett, DAGreenlee, WJLi, CHeimark, LPramanik, BGrilli, MBertorelli, RLozza, GReggiani, A Tricyclic thienopyridine-pyrimidones/thienopyrimidine-pyrimidones as orally efficacious mGluR1 antagonists for neuropathic pain. Bioorg Med Chem Lett 19:3199-203 (2009)  
Target
Name:
Metabotropic glutamate receptor 1
Synonyms:
GRM1_RAT Grm1 Metabotropic glutamate receptor Mglur1 metabotropic glutamate 1/5-D metabotropic glutamate receptor 1 isoform alpha precursor
Type:
Enzyme Catalytic Domain
Mol. Mass.:
133240.47
Organism:
RAT
Description:
metabotropic glutamate 1/2 0 RAT::P23385
Residue:
1199
  
Inhibitor
Name:
BDBM50345939
Synonyms:
9-(Allyl-methyl-amino)-3-(4-bromo-phenyl)-3H-pyrido[3',2':4,5]thieno[3,2-d]pyrimidin-4-one | CHEMBL1783866
Type:
Small organic molecule
Emp. Form.:
C19H15BrN4OS
Mol. Mass.:
427.318
SMILES:
CN(CC=C)c1ccnc2sc3c(ncn(-c4ccc(Br)cc4)c3=O)c12
: