Target
Carbonic anhydrase 7
Ligand
BDBM35730
Substrate
Meas. Tech.
ChEMBL_750233 (CHEMBL1788074)
Ki
7.1±n/a nM
Citation
 Güzel, OInnocenti, AScozzafava, ASalman, ASupuran, CT Carbonic anhydrase inhibitors. Phenacetyl-, pyridylacetyl- and thienylacetyl-substituted aromatic sulfonamides act as potent and selective isoform VII inhibitors. Bioorg Med Chem Lett 19:3170-3 (2009)  
Target
Name:
Carbonic anhydrase 7
Synonyms:
CA-VII CAH7_HUMAN Carbonic anhydrase Carbonic anhydrase VII (CA VII)
Type:
Enzyme
Mol. Mass.:
29664.11
Organism:
Homo sapiens (Human)
Description:
Human cloned isozyme.
Residue:
264
  
Inhibitor
Name:
BDBM35730
Synonyms:
cid_694792 | sulfonamide deriv., 5e
Type:
Small organic molecule
Emp. Form.:
C13H14N2O3S2
Mol. Mass.:
310.392
SMILES:
NS(=O)(=O)c1ccc(CNC(=O)Cc2cccs2)cc1
: