Target
5-hydroxytryptamine receptor 6
Ligand
BDBM50346061
Substrate
Meas. Tech.
ChEMBL_750452 (CHEMBL1786004)
IC50
440±n/a nM
Citation
 Ivachtchenko, AVFrolov, EBMitkin, ODKysil, VMKhvat, AVOkun, IMTkachenko, SE Synthesis and biological evaluation of novel gamma-carboline analogues of Dimebon as potent 5-HT6 receptor antagonists. Bioorg Med Chem Lett 19:3183-7 (2009)  
Target
Name:
5-hydroxytryptamine receptor 6
Synonyms:
5-HT-6 5-hydroxytryptamine receptor 6 (5-HT-6) 5-hydroxytryptamine receptor 6 (5HT6) HTR6 Serotonin 6 (5-HT6) receptor | Serotonin Receptor 6
Type:
G Protein-Coupled Receptor (GPCR)
Mol. Mass.:
46968.43
Organism:
Homo sapiens (Human)
Description:
P50406
Residue:
440
  
Inhibitor
Name:
BDBM50346061
Synonyms:
2,8-dimethyl-5-(2-(pyridin-3-yl)ethyl)-2,3,4,5-tetrahydro-1H-pyrido[4,3-b]indole | CHEMBL1783960
Type:
Small organic molecule
Emp. Form.:
C20H23N3
Mol. Mass.:
305.4167
SMILES:
CN1CCc2c(C1)c1cc(C)ccc1n2CCc1cccnc1
: