Target
Histamine H1 receptor
Ligand
BDBM50346062
Substrate
Meas. Tech.
ChEMBL_750445 (CHEMBL1785997)
IC50
1590±n/a nM
Citation
 Ivachtchenko, AVFrolov, EBMitkin, ODKysil, VMKhvat, AVOkun, IMTkachenko, SE Synthesis and biological evaluation of novel gamma-carboline analogues of Dimebon as potent 5-HT6 receptor antagonists. Bioorg Med Chem Lett 19:3183-7 (2009)  
Target
Name:
Histamine H1 receptor
Synonyms:
H1R HISTAMINE H1 HRH1_HUMAN
Type:
G Protein-Coupled Receptor (GPCR)
Mol. Mass.:
55808.72
Organism:
Homo sapiens (Human)
Description:
Cell pellets from SK-N-MC cells transfected with human H1 receptor were used in binding assay.
Residue:
487
  
Inhibitor
Name:
BDBM50346062
Synonyms:
2-methyl-5-(2-(pyridin-2-yl)ethyl)-8-(trifluoromethyl)-2,3,4,5-tetrahydro-1H-pyrido[4,3-b]indole | CHEMBL1783958
Type:
Small organic molecule
Emp. Form.:
C20H20F3N3
Mol. Mass.:
359.3881
SMILES:
CN1CCc2c(C1)c1cc(ccc1n2CCc1ccccn1)C(F)(F)F
: