Target
Histamine H3 receptor
Ligand
BDBM50346208
Substrate
Meas. Tech.
ChEMBL_749354 (CHEMBL1785144)
Ki
0.8±n/a nM
Citation
 Swanson, DMShah, CRLord, BMorton, KDvorak, LKMazur, CApodaca, RXiao, WBoggs, JDFeinstein, MWilson, SJBarbier, AJBonaventure, PLovenberg, TWCarruthers, NI Heterocyclic replacement of the central phenyl core of diamine-based histamine H3 receptor antagonists. Eur J Med Chem 44:4413-25 (2009)  
Target
Name:
Histamine H3 receptor
Synonyms:
G-protein coupled receptor 97 HH3R HRH3 Histamine H3 receptor (H3) Histamine receptor (H3 and H4)
Type:
G Protein-Coupled Receptor (GPCR)
Mol. Mass.:
48691.47
Organism:
Homo sapiens (Human)
Description:
Binding assays were using CHO cells stably expressing hH3R receptors.
Residue:
445
  
Inhibitor
Name:
BDBM50346208
Synonyms:
(1-isopropylpiperidin-4-yl)(4-(piperidin-1-ylmethyl)phenyl)methanone | CHEMBL1783889
Type:
Small organic molecule
Emp. Form.:
C20H31N3O
Mol. Mass.:
329.4796
SMILES:
CC(C)N1CCN(CC1)C(=O)c1ccc(CN2CCCCC2)cc1
: