Target
Histamine H3 receptor
Ligand
BDBM50346209
Substrate
Meas. Tech.
ChEMBL_749354 (CHEMBL1785144)
Ki
0.21±n/a nM
Citation
 Swanson, DMShah, CRLord, BMorton, KDvorak, LKMazur, CApodaca, RXiao, WBoggs, JDFeinstein, MWilson, SJBarbier, AJBonaventure, PLovenberg, TWCarruthers, NI Heterocyclic replacement of the central phenyl core of diamine-based histamine H3 receptor antagonists. Eur J Med Chem 44:4413-25 (2009)  
Target
Name:
Histamine H3 receptor
Synonyms:
G-protein coupled receptor 97 HH3R HRH3 Histamine H3 receptor (H3) Histamine receptor (H3 and H4)
Type:
G Protein-Coupled Receptor (GPCR)
Mol. Mass.:
48691.47
Organism:
Homo sapiens (Human)
Description:
Binding assays were using CHO cells stably expressing hH3R receptors.
Residue:
445
  
Inhibitor
Name:
BDBM50346209
Synonyms:
5-(3-cyclobutyl-2,3,4,5-tetrahydro-1H-benzo[d]azepin-7-yloxy)-N-methylpyrazine-2-carboxamide | CHEMBL1783890
Type:
Small organic molecule
Emp. Form.:
C20H24N4O2
Mol. Mass.:
352.4302
SMILES:
CNC(=O)c1cnc(Oc2ccc3CCN(CCc3c2)C2CCC2)cn1
: