Target
Neuropeptide Y receptor type 1
Ligand
BDBM50346228
Substrate
Meas. Tech.
ChEMBL_749575 (CHEMBL1787184)
IC50
>10000±n/a nM
Citation
 Ando, MSato, NNagase, TNagai, KIshikawa, STakahashi, HOhtake, NIto, JHirayama, MMitobe, YIwaasa, HGomori, AMatsushita, HTadano, KFujino, NTanaka, SOhe, TIshihara, AKanatani, AFukami, T Discovery of pyridone-containing imidazolines as potent and selective inhibitors of neuropeptide Y Y5 receptor. Bioorg Med Chem 17:6106-22 (2009)  
Target
Name:
Neuropeptide Y receptor type 1
Synonyms:
NPY-Y1 NPY1R NPYR neuropeptide Y receptor Y1
Type:
Enzyme Catalytic Domain
Mol. Mass.:
44399.07
Organism:
Homo sapiens (Human)
Description:
NPY-Y1 NPY1R HUMAN::P25929
Residue:
384
  
Inhibitor
Name:
BDBM50346228
Synonyms:
1-(Difluoromethyl)-5-[(4S,5S)-4-(4-fluorophenyl)-4-(6-fluoropyridin-3-yl)-5-methyl-4,5-dihydro-1H-imidazol-2-yl]pyridin-2(1H)-one | CHEMBL1784130
Type:
Small organic molecule
Emp. Form.:
C21H16F4N4O
Mol. Mass.:
416.3716
SMILES:
C[C@@H]1NC(=N[C@@]1(c1ccc(F)cc1)c1ccc(F)nc1)c1ccc(=O)n(c1)C(F)F
: