Target
Sodium/glucose cotransporter 2
Ligand
BDBM50244463
Substrate
Meas. Tech.
ChEMBL_750036 (CHEMBL1787313)
EC50
8±n/a nM
Citation
 Wu, JSPeng, YHWu, JMHsieh, CJWu, SHCoumar, MSSong, JSLee, JCTsai, CHChen, CTLiu, YWChao, YSWu, SY Discovery of non-glycoside sodium-dependent glucose co-transporter 2 (SGLT2) inhibitors by ligand-based virtual screening. J Med Chem 53:8770-4 (2010)  
Target
Name:
Sodium/glucose cotransporter 2
Synonyms:
Na(+)/glucose cotransporter 2 SGLT2 Sodium-Dependent Glucose Cotransporter 2 (SGLT2) Solute carrier family 5 member 2
Type:
Protein
Mol. Mass.:
72902.00
Organism:
Homo sapiens (Human)
Description:
P31639
Residue:
672
  
Inhibitor
Name:
BDBM50244463
Synonyms:
(2R,3S,4S,5R,6S)-2-Hydroxymethyl-6-[2-(4-methyl-benzyl)-phenoxy]-tetrahydro-pyran-3,4,5-triol | CHEMBL447016
Type:
Small organic molecule
Emp. Form.:
C20H24O6
Mol. Mass.:
360.401
SMILES:
Cc1ccc(Cc2ccccc2O[C@@H]2O[C@H](CO)[C@@H](O)[C@H](O)[C@H]2O)cc1
: