Target
Caspase-3
Ligand
BDBM50326100
Substrate
Meas. Tech.
ChEMBL_749585 (CHEMBL1787194)
IC50
16200±n/a nM
Citation
 Glória, PMCoutinho, IGonçalves, LMBaptista, CSoares, JNewton, ASMoreira, RSaraiva, LSantos, MM Aspartic vinyl sulfones: inhibitors of a caspase-3-dependent pathway. Eur J Med Chem 46:2141-6 (2011)  
Target
Name:
Caspase-3
Synonyms:
Apopain CASP3 CPP-32 Caspase 3 Caspase-3 subunit p17 SCA-1 Yama protein | caspase-3 preproprotein
Type:
Hydrolase; heterotetramer of two heterodimers
Mol. Mass.:
31607.55
Organism:
Homo sapiens (Human)
Description:
Residue:
277
  
Inhibitor
Name:
BDBM50326100
Synonyms:
(S)-3-(((9H-fluoren-9-yl)methoxy)carbonylamino)-5-(phenylsulfonyl)pent-4-enoic acid | CHEMBL1242421
Type:
Small organic molecule
Emp. Form.:
C26H23NO6S
Mol. Mass.:
477.529
SMILES:
OC(=O)C[C@H](NC(=O)OCC1c2ccccc2-c2ccccc12)C=CS(=O)(=O)c1ccccc1
: