Target
5-hydroxytryptamine receptor 2A
Ligand
BDBM50346374
Substrate
Meas. Tech.
ChEMBL_750209 (CHEMBL1787902)
Ki
5.29±n/a nM
Citation
 Fiorino, FMagli, EPerissutti, ESeverino, BFrecentese, FEsposito, ADe Angelis, FIncisivo, GMMassarelli, PNencini, CDi Gennaro, EBudillon, ADi Cintio, ASantagada, VCaliendo, G Synthesis of 1-naphtylpiperazine derivatives as serotoninergic ligands and their evaluation as antiproliferative agents. Eur J Med Chem 46:2206-16 (2011)  
Target
Name:
5-hydroxytryptamine receptor 2A
Synonyms:
5-HT-2A 5-HT2A 5-hydroxytryptamine receptor 2A (5HT2A) Htr2 Serotonin Receptor 2A
Type:
G Protein-Coupled Receptor (GPCR)
Mol. Mass.:
52852.05
Organism:
Rattus norvegicus (rat)
Description:
Rat cortex membranes 5-HT2A receptors.
Residue:
471
  
Inhibitor
Name:
BDBM50346374
Synonyms:
3-(2-(4-(naphthalen-1-yl)piperazin-1-yl)ethyl)benzo[d][1,2,3]triazin-4(3H)-one | CHEMBL1783346
Type:
Small organic molecule
Emp. Form.:
C23H23N5O
Mol. Mass.:
385.4616
SMILES:
O=c1n(CCN2CCN(CC2)c2cccc3ccccc23)nnc2ccccc12
: