Target
Leucyl-cystinyl aminopeptidase
Ligand
BDBM50346448
Substrate
Meas. Tech.
ChEMBL_751648 (CHEMBL1787846)
Ki
1.8±n/a nM
Citation
 Andersson, HDemaegdt, HJohnsson, AVauquelin, GLindeberg, GHallberg, MErdelyi, MKarlen, AHallberg, A Potent macrocyclic inhibitors of insulin-regulated aminopeptidase (IRAP) by olefin ring-closing metathesis. J Med Chem 54:3779-92 (2011)  
Target
Name:
Leucyl-cystinyl aminopeptidase
Synonyms:
Aminopeptidase Cystinyl aminopeptidase Insulin-regulated membrane aminopeptidase LCAP_HUMAN Leucyl-cystinyl aminopeptidase, pregnancy serum form Oxytocinase Placental leucine aminopeptidase
Type:
PROTEIN
Mol. Mass.:
117334.10
Organism:
Homo sapiens (Human)
Description:
ChEMBL_1473494
Residue:
1025
  
Inhibitor
Name:
BDBM50346448
Synonyms:
2-(2-(((2S,6S,13S,E)-13-Amino-2-(4-hydroxybenzyl)-4,14-dioxo-1,5-diazacyclotetradec-9-ene-6-carboxamido)methyl)phenyl)acetic Acid | CHEMBL1782887
Type:
Small organic molecule
Emp. Form.:
C29H36N4O6
Mol. Mass.:
536.6193
SMILES:
N[C@H]1CC\C=C\CC[C@H](NC(=O)C[C@H](Cc2ccc(O)cc2)NC1=O)C(=O)NCc1ccccc1CC(O)=O
: